{"text_format":"3","workbook":"xlsx","n_sheets":3,"sheets":["BM18","BM18A","Filtro_"],"not_rendered":{"macros":1,"external_links":1,"pivot_tables":1},"read":"whole","date_system":"1900"}

{"sheet":"BM18","index":0,"n_rows":122,"n_cols":23,"rows_kept":122,"merged":[[7,1,8,6],[9,1,9,3],[10,1,11,3],[10,4,11,4],[10,5,11,5],[10,6,11,6],[12,2,12,3],[13,2,13,3],[14,2,14,3],[15,2,15,3],[16,2,16,3],[17,2,17,3],[18,2,18,3],[19,2,19,3],[20,2,20,3],[21,2,21,3],[22,2,22,3],[23,2,23,3],[24,2,24,3],[25,2,25,3],[26,2,26,3],[27,2,27,3],[28,2,28,3],[29,1,42,1],[29,2,30,2],[31,2,32,2],[33,2,34,2],[35,2,36,2],[37,2,38,2],[39,2,40,2],[41,2,42,2],[43,2,43,3],[46,1,47,1],[46,2,47,2],[46,3,47,3],[46,4,47,4],[61,1,62,2],[61,3,62,3],[61,4,62,4],[61,5,62,5],[63,1,63,2],[70,1,71,1],[70,2,71,2],[70,3,71,3],[70,4,71,4],[80,1,81,1],[80,2,81,2],[84,1,85,1],[84,2,85,2],[84,3,84,8],[90,1,90,2],[91,1,93,1],[95,1,96,1],[95,2,96,2],[95,3,95,5],[95,6,96,6],[99,1,100,1],[99,2,100,2],[99,3,99,5],[99,6,100,6],[99,7,100,7],[99,8,100,8]]}
[null,"SERVICIO DE SALUD "]
[null,{"$f":"CONCATENATE(\"COMUNA: \",[1]NOMBRE!B2,\"  \",\"( \",[1]NOMBRE!C2,[1]NOMBRE!D2,[1]NOMBRE!E2,[1]NOMBRE!F2,[1]NOMBRE!G2,\" )\")","v":"COMUNA: 0  ( 00000 )"}]
[null,{"$f":"CONCATENATE(\"ESTABLECIMIENTO/ESTRATEGIA: \",[1]NOMBRE!B3,\"  \",\"( \",[1]NOMBRE!C3,[1]NOMBRE!D3,[1]NOMBRE!E3,[1]NOMBRE!F3,[1]NOMBRE!G3,[1]NOMBRE!H3,\" )\")","v":"ESTABLECIMIENTO/ESTRATEGIA: 0  ( 000000 )"}]
[null,{"$f":"CONCATENATE(\"MES: \",[1]NOMBRE!B6,\"  \",\"( \",[1]NOMBRE!C6,[1]NOMBRE!D6,\" )\")","v":"MES: 0  ( 00 )"}]
[null,{"$f":"CONCATENATE(\"AÑO: \",[1]NOMBRE!B7)","v":"AÑO: 2023"}]
[]
[]
[null,"REM-B18.   ACTIVIDADES DE APOYO DIAGNOSTICO Y TERAPEUTICO\n     (USO EXCLUSIVO DE ESTABLECIMIENTOS MUNICIPALES)"]
[]
[null,"SECCIÓN A: EXÁMENES DE DIAGNOSTICO"]
[null,"EXÁMENES",null,null,"TOTAL","SAPU/SAR/SUR","Resto Establecimientos APS"]
[{"$nulls":5},"Total","Total"]
[null,"TOTAL EXÁMENES LABORATORIO",null,null,{"$f":"SUM(F13:G13)","v":{"v":580585,"d":"580,585"}},{"$f":"SUM(F14:F16,F18:F19,F24:F25)","v":{"v":1681,"d":"1,681"}},{"$f":"SUM(G14:G16,G18:G19,G24:G25)","v":{"v":578904,"d":"578,904"}},"Linea"]
["18010100","I  ","HEMATOLÓGICOS",null,{"$f":"IFERROR(VLOOKUP('BM18'!$A14,Filtro_!$A$5:$I$358,2,FALSE),0)","v":{"v":86640,"d":"86,640"}},{"$f":"IFERROR(VLOOKUP('BM18'!$A14,Filtro_!$A$5:$I$358,3,FALSE),0)","v":0},{"$f":"IFERROR(VLOOKUP('BM18'!$A14,Filtro_!$A$5:$I$358,4,FALSE),0)","v":{"v":86640,"d":"86,640"}},14]
["18010200","II  ","BIOQUÍMICOS",null,{"$f":"IFERROR(VLOOKUP('BM18'!$A15,Filtro_!$A$5:$I$358,2,FALSE),0)","v":{"v":298537,"d":"298,537"}},{"$f":"IFERROR(VLOOKUP('BM18'!$A15,Filtro_!$A$5:$I$358,3,FALSE),0)","v":0},{"$f":"IFERROR(VLOOKUP('BM18'!$A15,Filtro_!$A$5:$I$358,4,FALSE),0)","v":{"v":298537,"d":"298,537"}},15]
["18090100","III","HORMONALES",null,{"$f":"IFERROR(VLOOKUP('BM18'!$A16,Filtro_!$A$5:$I$358,2,FALSE),0)","v":{"v":58189,"d":"58,189"}},{"$f":"IFERROR(VLOOKUP('BM18'!$A16,Filtro_!$A$5:$I$358,3,FALSE),0)","v":0},{"$f":"IFERROR(VLOOKUP('BM18'!$A16,Filtro_!$A$5:$I$358,4,FALSE),0)","v":{"v":58189,"d":"58,189"}},16]
[null,"IV","GENÉTICA",{"$nulls":4},17]
["18010500","V","INMUNOLÓGICOS",null,{"$f":"IFERROR(VLOOKUP('BM18'!$A18,Filtro_!$A$5:$I$358,2,FALSE),0)","v":{"v":3303,"d":"3,303"}},{"$f":"IFERROR(VLOOKUP('BM18'!$A18,Filtro_!$A$5:$I$358,3,FALSE),0)","v":0},{"$f":"IFERROR(VLOOKUP('BM18'!$A18,Filtro_!$A$5:$I$358,4,FALSE),0)","v":{"v":3303,"d":"3,303"}},18]
["18010601","VI  ","MICROBIOLÓGICOS",null,{"$f":"IFERROR(VLOOKUP('BM18'!$A19,Filtro_!$A$5:$I$358,2,FALSE),0)","v":{"v":21060,"d":"21,060"}},{"$f":"IFERROR(VLOOKUP('BM18'!$A19,Filtro_!$A$5:$I$358,3,FALSE),0)","v":0},{"$f":"IFERROR(VLOOKUP('BM18'!$A19,Filtro_!$A$5:$I$358,4,FALSE),0)","v":{"v":21060,"d":"21,060"}},19]
[null,null,"a)   BACTERIAS Y HONGOS",{"$nulls":4},20]
[null,null,"b)   PARÁSITOS",{"$nulls":4},21]
[null,null,"c)   VIRUS",{"$nulls":4},22]
[null,"VII","PROCEDIMIENTO O DETERMINACIÓN DIRECTA C/PACIENTE",{"$nulls":4},23]
["18010800","VIII  ","EX.  DE DEPOSICIONES EXUDADOS. SECREC. Y OTROS LIQ.  ",null,{"$f":"IFERROR(VLOOKUP('BM18'!$A24,Filtro_!$A$5:$I$358,2,FALSE),0)","v":{"v":2530,"d":"2,530"}},{"$f":"IFERROR(VLOOKUP('BM18'!$A24,Filtro_!$A$5:$I$358,3,FALSE),0)","v":0},{"$f":"IFERROR(VLOOKUP('BM18'!$A24,Filtro_!$A$5:$I$358,4,FALSE),0)","v":{"v":2530,"d":"2,530"}},24]
["18010900","IX   ","ORINA",null,{"$f":"IFERROR(VLOOKUP('BM18'!$A25,Filtro_!$A$5:$I$358,2,FALSE),0)","v":{"v":110326,"d":"110,326"}},{"$f":"IFERROR(VLOOKUP('BM18'!$A25,Filtro_!$A$5:$I$358,3,FALSE),0)","v":{"v":1681,"d":"1,681"}},{"$f":"IFERROR(VLOOKUP('BM18'!$A25,Filtro_!$A$5:$I$358,4,FALSE),0)","v":{"v":108645,"d":"108,645"}},25]
[null,"TOTAL EXÁMENES IMAGENOLOGIA",null,null,{"$f":"SUM(F26:G26)","v":{"v":48429,"d":"48,429"}},{"$f":"SUM(F27+F28+F44)","v":{"v":42115,"d":"42,115"}},{"$f":"SUM(G27+G28)","v":{"v":6314,"d":"6,314"}},26]
["18011001","a)","EX. RADIOLÓGICOS SIMPLES",null,{"$f":"IFERROR(VLOOKUP('BM18'!$A27,Filtro_!$A$5:$I$358,2,FALSE),0)","v":{"v":46684,"d":"46,684"}},{"$f":"IFERROR(VLOOKUP('BM18'!$A27,Filtro_!$A$5:$I$358,3,FALSE),0)","v":{"v":42056,"d":"42,056"}},{"$f":"IFERROR(VLOOKUP('BM18'!$A27,Filtro_!$A$5:$I$358,4,FALSE),0)","v":{"v":4628,"d":"4,628"}},27]
["18011002",null," Ecotomografías",null,{"$f":"IFERROR(VLOOKUP('BM18'!$A28,Filtro_!$A$5:$I$358,2,FALSE),0)","v":{"v":1745,"d":"1,745"}},{"$f":"IFERROR(VLOOKUP('BM18'!$A28,Filtro_!$A$5:$I$358,3,FALSE),0)","v":59},{"$f":"IFERROR(VLOOKUP('BM18'!$A28,Filtro_!$A$5:$I$358,4,FALSE),0)","v":{"v":1686,"d":"1,686"}},28]
["18400500",null," Ecotomografías abdominal ",null,{"$f":"SUM(F29:G29)","v":597},{"$f":"IFERROR(VLOOKUP('BM18'!$A29,Filtro_!$A$5:$I$358,3,FALSE),0)","v":0},{"$f":"IFERROR(VLOOKUP('BM18'!$A29,Filtro_!$A$5:$I$358,4,FALSE),0)","v":597},29]
["18700240",null,"Ecografías Obstétrica Primer Trimestre (<11 semanas)","Médico/a",{"$f":"IFERROR(VLOOKUP('BM18'!$A30,Filtro_!$A$5:$I$358,2,FALSE),0)","v":16},{"$f":"IFERROR(VLOOKUP('BM18'!$A30,Filtro_!$A$5:$I$358,3,FALSE),0)","v":0},{"$f":"IFERROR(VLOOKUP('BM18'!$A30,Filtro_!$A$5:$I$358,4,FALSE),0)","v":16},30]
["18700250",null,null,"Matrón/a",{"$f":"IFERROR(VLOOKUP('BM18'!$A31,Filtro_!$A$5:$I$358,2,FALSE),0)","v":688},{"$f":"IFERROR(VLOOKUP('BM18'!$A31,Filtro_!$A$5:$I$358,3,FALSE),0)","v":0},{"$f":"IFERROR(VLOOKUP('BM18'!$A31,Filtro_!$A$5:$I$358,4,FALSE),0)","v":688},31]
["18700260",null,"Ecografias Obstétricas Primer Trimestre (11 - 14 semanas)","Médico/a",{"$f":"IFERROR(VLOOKUP('BM18'!$A32,Filtro_!$A$5:$I$358,2,FALSE),0)","v":75},{"$f":"IFERROR(VLOOKUP('BM18'!$A32,Filtro_!$A$5:$I$358,3,FALSE),0)","v":0},{"$f":"IFERROR(VLOOKUP('BM18'!$A32,Filtro_!$A$5:$I$358,4,FALSE),0)","v":75},32]
["18700270",null,null,"Matrón/a",{"$f":"IFERROR(VLOOKUP('BM18'!$A33,Filtro_!$A$5:$I$358,2,FALSE),0)","v":{"v":1354,"d":"1,354"}},{"$f":"IFERROR(VLOOKUP('BM18'!$A33,Filtro_!$A$5:$I$358,3,FALSE),0)","v":0},{"$f":"IFERROR(VLOOKUP('BM18'!$A33,Filtro_!$A$5:$I$358,4,FALSE),0)","v":{"v":1354,"d":"1,354"}},33]
["18700280",null,"Ecografias Obstétricas Segundo Trimestre (22 - 24 semanas)","Médico/a",{"$f":"IFERROR(VLOOKUP('BM18'!$A34,Filtro_!$A$5:$I$358,2,FALSE),0)","v":206},{"$f":"IFERROR(VLOOKUP('BM18'!$A34,Filtro_!$A$5:$I$358,3,FALSE),0)","v":0},{"$f":"IFERROR(VLOOKUP('BM18'!$A34,Filtro_!$A$5:$I$358,4,FALSE),0)","v":206},34]
["18700290",null,null,"Matrón/a",{"$f":"IFERROR(VLOOKUP('BM18'!$A35,Filtro_!$A$5:$I$358,2,FALSE),0)","v":356},{"$f":"IFERROR(VLOOKUP('BM18'!$A35,Filtro_!$A$5:$I$358,3,FALSE),0)","v":0},{"$f":"IFERROR(VLOOKUP('BM18'!$A35,Filtro_!$A$5:$I$358,4,FALSE),0)","v":356},35]
["18700300",null,"Ecografias Obstétricas Tercer Trimestre (30 - 34 semanas)","Médico/a",{"$f":"IFERROR(VLOOKUP('BM18'!$A36,Filtro_!$A$5:$I$358,2,FALSE),0)","v":131},{"$f":"IFERROR(VLOOKUP('BM18'!$A36,Filtro_!$A$5:$I$358,3,FALSE),0)","v":0},{"$f":"IFERROR(VLOOKUP('BM18'!$A36,Filtro_!$A$5:$I$358,4,FALSE),0)","v":131},36]
["18700310",null,null,"Matrón/a",{"$f":"IFERROR(VLOOKUP('BM18'!$A37,Filtro_!$A$5:$I$358,2,FALSE),0)","v":495},{"$f":"IFERROR(VLOOKUP('BM18'!$A37,Filtro_!$A$5:$I$358,3,FALSE),0)","v":0},{"$f":"IFERROR(VLOOKUP('BM18'!$A37,Filtro_!$A$5:$I$358,4,FALSE),0)","v":495},37]
[null,null,"Total Ecografías Obstétricas por profesional","Médico/a",{"$f":"SUM(E30+E32+E34+E36)","v":428},{"$f":"IFERROR(VLOOKUP('BM18'!$A38,Filtro_!$A$5:$I$358,3,FALSE),0)","v":0},{"$f":"IFERROR(VLOOKUP('BM18'!$A38,Filtro_!$A$5:$I$358,4,FALSE),0)","v":0},38]
[{"$nulls":3},"Matrón/a",{"$f":"SUM(E31+E33+E35+E37)","v":{"v":2893,"d":"2,893"}},{"$f":"IFERROR(VLOOKUP('BM18'!$A39,Filtro_!$A$5:$I$358,3,FALSE),0)","v":0},{"$f":"IFERROR(VLOOKUP('BM18'!$A39,Filtro_!$A$5:$I$358,4,FALSE),0)","v":0},39]
["18700320",null,"Ecografía de seguimiento DIU (Regulación de la Fertilidad)","Médico/a",{"$f":"IFERROR(VLOOKUP('BM18'!$A40,Filtro_!$A$5:$I$358,2,FALSE),0)","v":0},{"$f":"IFERROR(VLOOKUP('BM18'!$A40,Filtro_!$A$5:$I$358,3,FALSE),0)","v":0},{"$f":"IFERROR(VLOOKUP('BM18'!$A40,Filtro_!$A$5:$I$358,4,FALSE),0)","v":0},40]
{"$rows_left_out":83}
{"sheet":"BM18A","index":1,"n_rows":652,"n_cols":10,"rows_kept":652,"merged":[[5,1,5,3],[6,1,6,6],[9,1,10,1],[9,2,10,2],[9,3,10,3],[9,4,10,4],[9,5,10,5],[9,6,10,6],[11,1,11,2],[11,3,11,6],[97,1,97,2],[99,1,99,2],[99,3,99,6],[169,1,169,2],[171,1,171,2],[171,3,171,6],[178,1,178,2],[180,1,180,2],[180,3,180,6],[238,1,238,2],[240,1,240,2],[240,3,240,6],[319,1,319,2],[321,1,321,2],[366,1,366,2],[368,1,368,2],[399,1,399,2],[400,1,400,2],[402,1,402,2],[402,3,402,6],[487,1,487,8],[488,1,489,1],[488,2,489,2],[488,3,489,3],[488,4,489,4],[488,5,489,5],[488,6,488,7],[488,8,489,8],[490,1,490,2],[490,3,490,8],[493,1,493,2],[493,3,493,8],[505,1,505,2],[507,1,507,2],[514,1,514,2],[516,1,516,2],[516,3,516,8],[519,1,519,2],[521,1,521,2],[521,3,521,8],[526,1,526,2],[528,1,528,2],[528,3,528,8],[540,1,540,2],[542,1,542,2],[542,3,542,8],[546,1,546,2],[548,1,548,2],[548,3,548,8],[551,1,551,2],[553,1,553,2],[553,3,553,8],[556,1,556,2],[556,3,556,8],[564,1,564,2],[566,1,566,2],[566,3,566,8],[591,1,591,2],[593,1,593,2],[593,3,593,8],[612,1,612,2],[614,3,615,3],[614,4,615,4],[614,5,615,5],[614,6,615,6],[618,1,618,2],[620,1,620,3],[620,4,620,8],[621,1,622,2],[621,4,622,4],[621,5,622,5],[621,6,621,7],[621,8,622,8]]}
[null,"SERVICIO DE SALUD "]
[null,{"$f":"CONCATENATE(\"COMUNA: \",[1]NOMBRE!B2,\"  \",\"( \",[1]NOMBRE!C2,[1]NOMBRE!D2,[1]NOMBRE!E2,[1]NOMBRE!F2,[1]NOMBRE!G2,\" )\")","v":"COMUNA: 0  ( 00000 )"}]
[null,{"$f":"CONCATENATE(\"ESTABLECIMIENTO/ESTRATEGIA: \",[1]NOMBRE!B3,\"  \",\"( \",[1]NOMBRE!C3,[1]NOMBRE!D3,[1]NOMBRE!E3,[1]NOMBRE!F3,[1]NOMBRE!G3,[1]NOMBRE!H3,\" )\")","v":"ESTABLECIMIENTO/ESTRATEGIA: 0  ( 000000 )"}]
[null,{"$f":"CONCATENATE(\"MES: \",[1]NOMBRE!B6,\"  \",\"( \",[1]NOMBRE!C6,[1]NOMBRE!D6,\" )\")","v":"MES: 0  ( 00 )"}]
[null,{"$f":"CONCATENATE(\"AÑO: \",[1]NOMBRE!B7)","v":"AÑO: 2023"}]
[]
[null,"REM-18A  -  LIBRO DE PRESTACIONES DE APOYO DIAGNOSTICO y TERAPÉUTICO\n(USO EXCLUSIVO DE ESTABLECIMIENTOS MUNICIPALES)"]
[]
[null,"SECCIÓN A: EXÁMENES DE DIAGNOSTICO"]
[null,"CÓDIGOS","EXÁMENES","TOTAL","SAPU/SAR/SUR","Resto Establecimientos APS","Compra de Servicios"]
[]
[null,"SANGRE HEMATOLOGÍA",{"$nulls":5},"Línea"]
["80301001","0301001","Acidificación del suero, test de Ham",{"$f":"SUM(E13:F13)","v":0},{"$f":"IFERROR(VLOOKUP($A13,Filtro_!$A$5:$I$358,3,FALSE),0)","v":0},{"$f":"IFERROR(VLOOKUP($A13,Filtro_!$A$5:$I$358,4,FALSE),0)","v":0},{"$f":"IFERROR(VLOOKUP($A13,Filtro_!$A$5:$I$358,5,FALSE),0)","v":0},13]
["80301002","0301002","Acido fólico o folatos",{"$f":"SUM(E14:F14)","v":0},{"$f":"IFERROR(VLOOKUP($A14,Filtro_!$A$5:$I$358,3,FALSE),0)","v":0},{"$f":"IFERROR(VLOOKUP($A14,Filtro_!$A$5:$I$358,4,FALSE),0)","v":0},{"$f":"IFERROR(VLOOKUP($A14,Filtro_!$A$5:$I$358,5,FALSE),0)","v":26},14]
["80301003","0301003","Adenograma, esplenograma, mielograma c/u",0,{"$f":"IFERROR(VLOOKUP($A15,Filtro_!$A$5:$I$358,3,FALSE),0)","v":0},{"$f":"IFERROR(VLOOKUP($A15,Filtro_!$A$5:$I$358,4,FALSE),0)","v":0},{"$f":"IFERROR(VLOOKUP($A15,Filtro_!$A$5:$I$358,5,FALSE),0)","v":0},15]
["80301004","0301004","Adhesividad plaquetaria",0,{"$f":"IFERROR(VLOOKUP($A16,Filtro_!$A$5:$I$358,3,FALSE),0)","v":0},{"$f":"IFERROR(VLOOKUP($A16,Filtro_!$A$5:$I$358,4,FALSE),0)","v":0},{"$f":"IFERROR(VLOOKUP($A16,Filtro_!$A$5:$I$358,5,FALSE),0)","v":0},16]
["80301005","0301005","Aglutininas anti Rho",0,{"$f":"IFERROR(VLOOKUP($A17,Filtro_!$A$5:$I$358,3,FALSE),0)","v":0},{"$f":"IFERROR(VLOOKUP($A17,Filtro_!$A$5:$I$358,4,FALSE),0)","v":0},{"$f":"IFERROR(VLOOKUP($A17,Filtro_!$A$5:$I$358,5,FALSE),0)","v":0},17]
["80301006","0301006","Agregación plaquetaria",0,{"$f":"IFERROR(VLOOKUP($A18,Filtro_!$A$5:$I$358,3,FALSE),0)","v":0},{"$f":"IFERROR(VLOOKUP($A18,Filtro_!$A$5:$I$358,4,FALSE),0)","v":0},{"$f":"IFERROR(VLOOKUP($A18,Filtro_!$A$5:$I$358,5,FALSE),0)","v":0},18]
["80301007","0301007","Anticoagulantes circulantes o anticoagulante lúpico",0,{"$f":"IFERROR(VLOOKUP($A19,Filtro_!$A$5:$I$358,3,FALSE),0)","v":0},{"$f":"IFERROR(VLOOKUP($A19,Filtro_!$A$5:$I$358,4,FALSE),0)","v":0},{"$f":"IFERROR(VLOOKUP($A19,Filtro_!$A$5:$I$358,5,FALSE),0)","v":0},19]
["80301008","0301008","Antitrombina III",0,{"$f":"IFERROR(VLOOKUP($A20,Filtro_!$A$5:$I$358,3,FALSE),0)","v":0},{"$f":"IFERROR(VLOOKUP($A20,Filtro_!$A$5:$I$358,4,FALSE),0)","v":0},{"$f":"IFERROR(VLOOKUP($A20,Filtro_!$A$5:$I$358,5,FALSE),0)","v":0},20]
["80301009","0301009","Auto-hemólisis test,  con y sin glucosa",0,{"$f":"IFERROR(VLOOKUP($A21,Filtro_!$A$5:$I$358,3,FALSE),0)","v":0},{"$f":"IFERROR(VLOOKUP($A21,Filtro_!$A$5:$I$358,4,FALSE),0)","v":0},{"$f":"IFERROR(VLOOKUP($A21,Filtro_!$A$5:$I$358,5,FALSE),0)","v":0},21]
["80301010","0301010","Células del lupus, cada muestra",0,{"$f":"IFERROR(VLOOKUP($A22,Filtro_!$A$5:$I$358,3,FALSE),0)","v":0},{"$f":"IFERROR(VLOOKUP($A22,Filtro_!$A$5:$I$358,4,FALSE),0)","v":0},{"$f":"IFERROR(VLOOKUP($A22,Filtro_!$A$5:$I$358,5,FALSE),0)","v":0},22]
["80301011","0301011","Coagulación, tiempo de",0,{"$f":"IFERROR(VLOOKUP($A23,Filtro_!$A$5:$I$358,3,FALSE),0)","v":0},{"$f":"IFERROR(VLOOKUP($A23,Filtro_!$A$5:$I$358,4,FALSE),0)","v":0},{"$f":"IFERROR(VLOOKUP($A23,Filtro_!$A$5:$I$358,5,FALSE),0)","v":249},23]
["80301012","0301012","Coágulo,  tiempo de retracción del",0,{"$f":"IFERROR(VLOOKUP($A24,Filtro_!$A$5:$I$358,3,FALSE),0)","v":0},{"$f":"IFERROR(VLOOKUP($A24,Filtro_!$A$5:$I$358,4,FALSE),0)","v":0},{"$f":"IFERROR(VLOOKUP($A24,Filtro_!$A$5:$I$358,5,FALSE),0)","v":0},24]
["80301013","0301013","Coágulo, tiempo de lisis del",0,{"$f":"IFERROR(VLOOKUP($A25,Filtro_!$A$5:$I$358,3,FALSE),0)","v":0},{"$f":"IFERROR(VLOOKUP($A25,Filtro_!$A$5:$I$358,4,FALSE),0)","v":0},{"$f":"IFERROR(VLOOKUP($A25,Filtro_!$A$5:$I$358,5,FALSE),0)","v":0},25]
["80301014","0301014","Coombs directo, test de",0,{"$f":"IFERROR(VLOOKUP($A26,Filtro_!$A$5:$I$358,3,FALSE),0)","v":0},{"$f":"IFERROR(VLOOKUP($A26,Filtro_!$A$5:$I$358,4,FALSE),0)","v":0},{"$f":"IFERROR(VLOOKUP($A26,Filtro_!$A$5:$I$358,5,FALSE),0)","v":136},26]
["80301015","0301015","Coombs indirecto, prueba de",2,{"$f":"IFERROR(VLOOKUP($A27,Filtro_!$A$5:$I$358,3,FALSE),0)","v":0},{"$f":"IFERROR(VLOOKUP($A27,Filtro_!$A$5:$I$358,4,FALSE),0)","v":2},{"$f":"IFERROR(VLOOKUP($A27,Filtro_!$A$5:$I$358,5,FALSE),0)","v":{"v":1611,"d":"1,611"}},27]
["80301016","0301016","Cuerpos de Heinz",0,{"$f":"IFERROR(VLOOKUP($A28,Filtro_!$A$5:$I$358,3,FALSE),0)","v":0},{"$f":"IFERROR(VLOOKUP($A28,Filtro_!$A$5:$I$358,4,FALSE),0)","v":0},{"$f":"IFERROR(VLOOKUP($A28,Filtro_!$A$5:$I$358,5,FALSE),0)","v":0},28]
["80301017","0301017","Deshidrogenasa glucosa-6-fosfato en eritrocitos",0,{"$f":"IFERROR(VLOOKUP($A29,Filtro_!$A$5:$I$358,3,FALSE),0)","v":0},{"$f":"IFERROR(VLOOKUP($A29,Filtro_!$A$5:$I$358,4,FALSE),0)","v":0},{"$f":"IFERROR(VLOOKUP($A29,Filtro_!$A$5:$I$358,5,FALSE),0)","v":0},29]
["80301020","0301020","Euglobulinas, tiempo de lisis de",0,{"$f":"IFERROR(VLOOKUP($A30,Filtro_!$A$5:$I$358,3,FALSE),0)","v":0},{"$f":"IFERROR(VLOOKUP($A30,Filtro_!$A$5:$I$358,4,FALSE),0)","v":0},{"$f":"IFERROR(VLOOKUP($A30,Filtro_!$A$5:$I$358,5,FALSE),0)","v":0},30]
["80301021","0301021","Fibrinógeno",0,{"$f":"IFERROR(VLOOKUP($A31,Filtro_!$A$5:$I$358,3,FALSE),0)","v":0},{"$f":"IFERROR(VLOOKUP($A31,Filtro_!$A$5:$I$358,4,FALSE),0)","v":0},{"$f":"IFERROR(VLOOKUP($A31,Filtro_!$A$5:$I$358,5,FALSE),0)","v":0},31]
["80301022","0301022","Test de neutralización plaquetaria",0,{"$f":"IFERROR(VLOOKUP($A32,Filtro_!$A$5:$I$358,3,FALSE),0)","v":0},{"$f":"IFERROR(VLOOKUP($A32,Filtro_!$A$5:$I$358,4,FALSE),0)","v":0},{"$f":"IFERROR(VLOOKUP($A32,Filtro_!$A$5:$I$358,5,FALSE),0)","v":0},32]
["80301023","0301023","Factor III plaquetario",0,{"$f":"IFERROR(VLOOKUP($A33,Filtro_!$A$5:$I$358,3,FALSE),0)","v":0},{"$f":"IFERROR(VLOOKUP($A33,Filtro_!$A$5:$I$358,4,FALSE),0)","v":0},{"$f":"IFERROR(VLOOKUP($A33,Filtro_!$A$5:$I$358,5,FALSE),0)","v":0},33]
["80301024","0301024","Factor V",0,{"$f":"IFERROR(VLOOKUP($A34,Filtro_!$A$5:$I$358,3,FALSE),0)","v":0},{"$f":"IFERROR(VLOOKUP($A34,Filtro_!$A$5:$I$358,4,FALSE),0)","v":0},{"$f":"IFERROR(VLOOKUP($A34,Filtro_!$A$5:$I$358,5,FALSE),0)","v":0},34]
["80301025","0301025","Factores VII, VIII, IX, X, XI, XII, XIII, c/u",0,{"$f":"IFERROR(VLOOKUP($A35,Filtro_!$A$5:$I$358,3,FALSE),0)","v":0},{"$f":"IFERROR(VLOOKUP($A35,Filtro_!$A$5:$I$358,4,FALSE),0)","v":0},{"$f":"IFERROR(VLOOKUP($A35,Filtro_!$A$5:$I$358,5,FALSE),0)","v":0},35]
["80301026","0301026","Ferritina",0,{"$f":"IFERROR(VLOOKUP($A36,Filtro_!$A$5:$I$358,3,FALSE),0)","v":0},{"$f":"IFERROR(VLOOKUP($A36,Filtro_!$A$5:$I$358,4,FALSE),0)","v":0},{"$f":"IFERROR(VLOOKUP($A36,Filtro_!$A$5:$I$358,5,FALSE),0)","v":{"v":2128,"d":"2,128"}},36]
["80301027","0301027","Fibrinógeno, productos de degradación del",0,{"$f":"IFERROR(VLOOKUP($A37,Filtro_!$A$5:$I$358,3,FALSE),0)","v":0},{"$f":"IFERROR(VLOOKUP($A37,Filtro_!$A$5:$I$358,4,FALSE),0)","v":0},{"$f":"IFERROR(VLOOKUP($A37,Filtro_!$A$5:$I$358,5,FALSE),0)","v":1},37]
["80301028","0301028","Fierro sérico",0,{"$f":"IFERROR(VLOOKUP($A38,Filtro_!$A$5:$I$358,3,FALSE),0)","v":0},{"$f":"IFERROR(VLOOKUP($A38,Filtro_!$A$5:$I$358,4,FALSE),0)","v":0},{"$f":"IFERROR(VLOOKUP($A38,Filtro_!$A$5:$I$358,5,FALSE),0)","v":2},38]
["80301029","0301029","Fierro, capacidad de fijación del (incluye fierro sérico)",0,{"$f":"IFERROR(VLOOKUP($A39,Filtro_!$A$5:$I$358,3,FALSE),0)","v":0},{"$f":"IFERROR(VLOOKUP($A39,Filtro_!$A$5:$I$358,4,FALSE),0)","v":0},{"$f":"IFERROR(VLOOKUP($A39,Filtro_!$A$5:$I$358,5,FALSE),0)","v":0},39]
["80301030","0301030","Fierro, cinética del (cada determinación)",0,{"$f":"IFERROR(VLOOKUP($A40,Filtro_!$A$5:$I$358,3,FALSE),0)","v":0},{"$f":"IFERROR(VLOOKUP($A40,Filtro_!$A$5:$I$358,4,FALSE),0)","v":0},{"$f":"IFERROR(VLOOKUP($A40,Filtro_!$A$5:$I$358,5,FALSE),0)","v":1},40]
{"$rows_left_out":613}
{"sheet":"Filtro_","index":2,"n_rows":358,"n_cols":9,"rows_kept":358}
["Comuna","(Todas)"]
["Establecimiento","(Todas)"]
["Mes","(Todas)"]
[]
["Etiquetas de fila","Suma de Col01","Suma de Col02","Suma de Col03","Suma de Col04","Suma de Col05","Suma de Col06","Suma de Col07","Cuenta de Col08"]
["18010100",86640,0,86640]
["18010200",298537,0,298537]
["18010500",3303,0,3303]
["18010601",21060,0,21060]
["18010800",2530,0,2530]
["18010900",110326,1681,108645]
["18011001",46684,42056,4628]
["18011002",1745,59,1686]
["18020200",202,137,65]
["18020300",19751,15961,3790]
["18020400",917,0,917]
["18020500",138971,30228,108743]
["18020600",177,145,32]
["18020700",1518,1095,423]
["18020800",1891,1888,3]
["18020900",1122,0,1122]
["18030000",6477,3837,2640]
["18040100",3801,520,3281]
["18040200",2521,154,2375]
["18050100",95880,14064,81848]
["18050200",3590,1460,2130]
["18050300",1221,193,1028]
["18050400",7677,473,7204]
["18050500",52241,1817,50424]
["18070100",512,13,297,107,26,7,62]
["18070300",1838,442,622,84,68,341,281]
["18090000",31676,865,30807]
["18090100",58189,0,58189]
["18090200",9573,1968]
["18090300",20]
["18400400",265,187,78]
["18400500",597,0,597]
["18400700",1179567]
["18400900",14964,2840,12124]
["18700100",11333,3452,6165,1716,0]
{"$rows_left_out":318}